{"text_format":"1","workbook":"xlsx","n_sheets":16,"sheets":["Inicio","Actualizar","TempListas","TempListas2","Proveedores","Anexo Técnico","SolCotizacion","ResumenCotizacion","Cotizacion","Lote 1 Básico","Lote 1 AATL","Lote 1 SIIF","Lote 1 AATL + SIIF","Lote 2","CSV","formatoCeldas"],"not_rendered":{"charts":0,"images":18,"macros":1,"external_links":0,"defined_names":35,"comments":0,"pivot_tables":0},"unopened":[],"bounds":{"document_bytes":16777216,"sheet_cells":100000,"rows_first":2000,"rows_last":500,"rows_between":2000,"halvings":0,"cell_chars":16384,"cell_head_chars":4096},"cells_cut":0,"cells_raw":0,"read":"whole","date_system":"1900"}

{"sheet":"Inicio","index":0,"n_rows":14,"n_cols":4,"rows_kept":14,"cut":false,"hidden":false,"merged":[[4,0,4,4],[0,0,0,4],[1,0,1,4]]}
["INICIO"]
["Acuerdo Marco para la Adquisición de Productos y servicios electrónicos y digitales de confianza"]
["Versión 7   18/07/2024"]
[]
["Productos"]
[]
[]
[null,"#","Lote/Segmento","Si/No"]
[null,1,"Lote 1 - Segmento 1","No"]
[null,2,"Lote 1 - Segmento 2","No"]
[null,3,"Lote 1 - Segmento 3","No"]
[null,3,"Lote 1 - Segmento 4","No"]
[null,4,"Lote 1 - Segmento 5","No"]
[null,5,"Lote 2","Si"]

{"sheet":"Actualizar","index":1,"n_rows":0,"n_cols":0,"rows_kept":0,"cut":false,"hidden":true,"merged":[]}

{"sheet":"TempListas","index":2,"n_rows":46,"n_cols":1,"rows_kept":46,"cut":false,"hidden":true,"merged":[]}
["AMSEDC-SSL-01-1"]
["AMSEDC-SSL-01-2"]
["AMSEDC-SSL-02 -1"]
["AMSEDC-SSL-02 -2"]
["AMSEDC-SSL-02 -3"]
["AMSEDC-SSL-02 -4"]
["AMSEDC-SSL-02 -5"]
["AMSEDC-SSL-02 -6"]
["AMSEDC-SSL-02 -7"]
["AMSEDC-SSL-02 -8"]
["AMSEDC-SSL-03-1"]
["AMSEDC-SSL-03-2"]
["AMSEDC-SSL-03-3"]
["AMSEDC-SSL-03-4"]
["AMSEDC-SAT-1-1"]
{"$rows_left_out":32}
{"sheet":"TempListas2","index":3,"n_rows":3,"n_cols":4,"rows_kept":3,"cut":false,"hidden":true,"merged":[]}
[]
["AMSEDC-SSL-01-2",327840,207632,218560]
[null,{"$f":"+SUM(B2:B2)","v":327840},{"$f":"+SUM(C2:C2)","v":207632},{"$f":"+SUM(D2:D2)","v":218560}]

{"sheet":"Proveedores","index":4,"n_rows":7,"n_cols":13,"rows_kept":7,"cut":false,"hidden":true,"merged":[]}
["Proveedor","NIT",null,null,"Lote_1_Segmento_1","Lote_1_Segmento_2","Lote 1 - Segmento 3","Lote_1_Segmento_4","Lote_1_ Segmento_5","Lote_2",null,"Lote_Segmento","Tabla"]
["GSE SA","900204272-8",null,null,"GSE SA","GSE SA",null,"GSE SA","GSE SA","GSE SA",null,"Lote 1 - Segmento 1","Lote_1_Segmento_1"]
["Certicámara SA","830084433-7",null,null,"Certicámara SA","Certicámara SA",null,"Certicámara SA","Certicámara SA","Certicámara SA",null,"Lote 1 - Segmento 2","Lote_1_Segmento_2"]
["Camerfirma","901312112-4",null,null,"Camerfirma","Camerfirma",null,"Camerfirma","Camerfirma","Camerfirma",null,"Lote 1 - Segmento 3","Lote_1_Segmento_3"]
["Olimpia IT","900032774 - 4",null,null,"Olimpia IT",null,null,"Olimpia IT",null,null,null,"Lote 1 - Segmento 4","Lote_1_Segmento_4"]
[null,null,null,null,null,null,null,null,null,null,null,"Lote 1 - Segmento 5","Lote_1_Segmento_5"]
[null,null,null,null,null,null,null,null,null,null,null,"Lote 2","Lote_2"]

{"sheet":"Anexo Técnico","index":5,"n_rows":17,"n_cols":4,"rows_kept":17,"cut":false,"hidden":false,"merged":[[0,1,0,3],[1,1,1,3],[2,1,2,3]]}
[null,"Con el objetivo de complementar el entendimiento sobre la solicitud de Productos y Servicios Electrónicos y Digitales de Confianza, por favor diligencie la totalidad de la información que se pide a continuación."]
[]
[null,"Tenga en cuenta que esta información es de utilidad para que el Proveedor pueda cotizar de la manera más precisa posible los Productos y Servicios Electrónicos y Digitales de Confianza, por lo cual la exactitud y completitud es muy importante."]
["No","Requerimiento adicional","Descripción ","INFORMACION SUMINISTRADA POR LA ENTIDAD COMPRADORA"]
[1,"Nombre y Nit de la Entidad Estatal a la cual se le entregará la titularidad de las licencias adquiridas."]
[2,"Lugar de entrega de los Productos y Servicios. (Especificar dirección y ciudad de entrega)."]
[3,"Datos Contacto de entrega (Especificar nombre, teléfono y correo electrónico)."]
[4,"En caso de incluir la especificación de Adobe Approved trust list, AATL, diligencie la correpsondiente justificación."]
[5,"Funciones a realizar el soporte en sitio.",null,"N/A"]
[6,"Perfil (técnico/tecnólogo o profesional) de las personas que prestan servicios adicionales en los casos que aplique.",null,"N/A"]
[7,"Área de conocimiento de las personas que prestan servicios adicionales",null,"N/A"]
[8,"Mecanismo de solicitud del soporte reactivo.",null,"N/A"]
[9,"Especificar que información o que bases de datos se van a migrar. Aplica en el caso que la Entidad Compradora solicite el servicio de migración de información o de bases de datos.",null,"N/A"]
[10,"Actividades del gerente de cuenta.",null,"N/A"]
[11,"Indique número de personas que requieren de capacitación. En caso que la Entidad Compradora solicite el servicio de capacitación usuario final o usuario técnico.",null,"N/A"]
{"$rows_left_out":3}
{"sheet":"SolCotizacion","index":6,"n_rows":33,"n_cols":16,"rows_kept":33,"cut":false,"hidden":true,"merged":[[16,6,16,7],[16,9,16,10],[10,0,10,2],[10,3,10,8],[14,0,14,13],[12,0,12,2],[12,3,12,8],[10,10,10,13],[18,5,18,6],[17,1,17,4],[16,4,16,5],[32,4,32,6],[32,7,32,8],[29,1,29,6],[29,7,29,8],[30,1,30,6],[30,7,30,8],[21,1,21,2],[20,3,20,7],[21,3,21,7],[23,0,23,13],[25,0,28,8],[20,1,20,2],[16,12,16,13],[0,0,0,13],[2,0,2,13],[4,0,4,13],[8,0,8,2],[8,3,8,8],[6,0,6,2],[6,3,6,8],[3,0,3,13],[1,0,1,13],[6,10,6,13],[8,10,8,13]]}
["SOLICITUD DE COTIZACIÓN"]
["Solicitud de Cotización "]
["Acuerdo Marco para la Adquisición de Productos y servicios electrónicos y digitales de confianza"]
[{"$f":"+Inicio!A3","v":"Versión 7   18/07/2024"}]
["Información de la Entidad Compradora"]
[]
["Nombre de la Entidad:",null,null,null,null,null,null,null,null,"NIT:"]
[]
["Dirección de la Entidad:",null,null,null,null,null,null,null,null,"Municipio:"]
[]
["Nombre del Comprador:",null,null,null,null,null,null,null,null,"Teléfono:"]
[]
["Correo del comprador:"]
[]
[" Artículos Solicitud de Cotización"]
{"$rows_left_out":19}
{"sheet":"ResumenCotizacion","index":7,"n_rows":37,"n_cols":19,"rows_kept":37,"cut":false,"hidden":true,"merged":[[23,14,23,16],[27,0,27,18],[21,1,21,2],[10,0,10,2],[10,3,10,8],[10,10,10,12],[14,0,14,18],[24,14,24,16],[25,17,25,18],[25,14,25,16],[23,17,23,18],[24,17,24,18],[21,3,21,7],[16,9,16,10],[18,7,18,8],[12,0,12,2],[36,4,36,6],[36,7,36,8],[29,0,32,8],[33,1,33,6],[33,7,33,8],[34,1,34,6],[34,7,34,8],[1,0,1,13],[3,0,3,13],[4,0,4,18],[0,0,0,18],[2,0,2,18],[6,0,6,2],[6,3,6,8],[6,10,6,12],[12,3,12,8],[8,0,8,2],[8,3,8,8],[8,10,8,12],[20,1,20,2],[16,6,16,7],[16,12,16,13],[20,3,20,7],[18,5,18,6],[16,4,16,5]]}
["RESUMEN DE COTIZACIÓN"]
["Solicitud de Cotización "]
["Acuerdo Marco para la Adquisición de Productos y servicios electrónicos y digitales de confianza"]
[{"$f":"+SolCotizacion!$A$4","v":"Versión 7   18/07/2024"}]
["Información de la Entidad Compradora"]
[]
["Nombre de la Entidad:",null,null,{"$f":"SolCotizacion!D7","v":0},null,null,null,null,null,"NIT:",{"$f":"SolCotizacion!K7","v":0}]
[]
["Dirección de la Entidad:",null,null,{"$f":"SolCotizacion!D9","v":0},null,null,null,null,null,"Municipio:",{"$f":"SolCotizacion!K9","v":0}]
[]
["Nombre del Comprador:",null,null,{"$f":"SolCotizacion!D11","v":0},null,null,null,null,null,"Teléfono:",{"$f":"SolCotizacion!K11","v":0}]
[]
["Correo del comprador:",null,null,{"$f":"SolCotizacion!D13","v":0}]
[]
[" Artículos de la Cotización"]
{"$rows_left_out":23}
{"sheet":"Cotizacion","index":8,"n_rows":37,"n_cols":21,"rows_kept":37,"cut":false,"hidden":true,"merged":[[10,18,10,19],[27,0,27,8],[12,0,12,2],[12,3,12,8],[21,3,21,7],[16,4,16,5],[18,5,18,6],[18,7,18,8],[20,3,20,7],[20,1,20,2],[23,16,23,19],[16,9,16,10],[16,12,16,13],[24,16,24,19],[25,16,25,19],[8,16,8,17],[8,18,8,19],[36,4,36,6],[36,7,36,8],[34,1,34,6],[34,7,34,8],[29,0,32,8],[33,1,33,6],[33,7,33,8],[10,0,10,2],[10,3,10,8],[10,10,10,12],[21,1,21,2],[16,6,16,7],[14,0,14,20],[10,16,10,17],[6,0,6,2],[6,3,6,8],[6,10,6,12],[8,0,8,2],[8,3,8,8],[8,10,8,12],[1,0,1,13],[3,0,3,13],[4,15,4,20],[4,0,4,12],[0,0,0,20],[2,0,2,20]]}
["COTIZACIÓN"]
["Solicitud de Cotización "]
["Acuerdo Marco para la Adquisición de Productos y servicios electrónicos y digitales de confianza"]
[{"$f":"+SolCotizacion!$A$4","v":"Versión 7   18/07/2024"}]
["Información de la Entidad Compradora",null,null,null,null,null,null,null,null,null,null,null,null,null,null,"Datos Proveedor"]
[]
["Nombre de la Entidad:",null,null,{"$f":"SolCotizacion!D7","v":0},null,null,null,null,null,"NIT:",{"$f":"SolCotizacion!K7","v":0}]
[]
["Dirección de la Entidad:",null,null,{"$f":"SolCotizacion!D9","v":0},null,null,null,null,null,"Municipio:",{"$f":"SolCotizacion!K9","v":0},null,null,null,null,null,"Proveedor"]
[]
["Nombre del Comprador:",null,null,{"$f":"SolCotizacion!D11","v":0},null,null,null,null,null,"Teléfono:",{"$f":"SolCotizacion!K11","v":0},null,null,null,null,null,"NIT",null,{"$f":"IFERROR(VLOOKUP(Proveedor_C,Proveedores!A2:B5,2,0),\"\")","v":""}]
[]
["Correo del comprador:",null,null,{"$f":"SolCotizacion!D13","v":0}]
[]
[" Artículos de la Cotización"]
{"$rows_left_out":23}
{"sheet":"Lote 1 Básico","index":9,"n_rows":89,"n_cols":11,"rows_kept":89,"cut":false,"hidden":true,"merged":[]}
["CODIGO","NOMBRE","Característica 1","Característica 2","Característica 3","Característica 4","Unidad de facturación","GSE SA","Certicámara SA","Camerfirma","Olimpia IT"]
["AMSEDC-CD-01-1","Certificados de Firma Electrónica Acreditado","SEGMENTO 2","N/A","N/A","Todas las zonas","Plataforma mes",7649600,1420640,36062400,"N/A"]
["AMSEDC-CD-01-2","Certificados de Firma Electrónica Acreditado","SEGMENTO 2","N/A","N/A","Todas las zonas","Transacción",874.24,10490.88,3562.5279999999998,"N/A"]
["AMSEDC-CD-02-1","Certificados digitales de persona natural Acreditado","SEGMENTO 1 y 4","Token físico","1 año","Zona 1","Certificado",142064,273200,163920,229488]
["AMSEDC-CD-02-2","Certificados digitales de persona natural Acreditado","SEGMENTO 1 y 4","Token físico","1 año","Zona 2","Certificado",156270.39999999999,273200,174848,229488]
["AMSEDC-CD-02-3","Certificados digitales de persona natural Acreditado","SEGMENTO 1 y 4","Token físico","1 año","Zona 3","Certificado",161734.39999999999,273200,196704,229488]
["AMSEDC-CD-02-4","Certificados digitales de persona natural Acreditado","SEGMENTO 1 y 4","Token virtual","1 año","Todas las zonas","Certificado",131136,251344,174848,165012.79999999999]
["AMSEDC-CD-02-5","Certificados digitales de persona natural Acreditado","SEGMENTO 1 y 4","Token físico","2 años","Zona 1","Certificado",199982.4,327840,245880,338768]
["AMSEDC-CD-02-6","Certificados digitales de persona natural Acreditado","SEGMENTO 1 y 4","Token físico","2 años","Zona 2","Certificado",218560,327840,262272,338768]
["AMSEDC-CD-02-7","Certificados digitales de persona natural Acreditado","SEGMENTO 1 y 4","Token físico","2 años","Zona 3","Certificado",225116.79999999999,327840,295056,338768]
["AMSEDC-CD-02-8","Certificados digitales de persona natural Acreditado","SEGMENTO 1 y 4","Token virtual","2 años","Todas las zonas","Certificado",157363.20000000001,327840,262272,273200]
["AMSEDC-CD-03-1","Certificados digitales de profesional titulado Acreditado","SEGMENTO 1 y 4","Token físico","1 año","Zona 1","Certificado",142064,273200,163920,229488]
["AMSEDC-CD-03-2","Certificados digitales de profesional titulado Acreditado","SEGMENTO 1 y 4","Token físico","1 año","Zona 2","Certificado",156270.39999999999,273200,174848,229488]
["AMSEDC-CD-03-3","Certificados digitales de profesional titulado Acreditado","SEGMENTO 1 y 4","Token físico","1 año","Zona 3","Certificado",180312,273200,196704,229488]
["AMSEDC-CD-03-4","Certificados digitales de profesional titulado Acreditado","SEGMENTO 1 y 4","Token virtual","1 año","Todas las zonas","Certificado",131136,251344,174848,165012.79999999999]
{"$rows_left_out":75}
{"sheet":"Lote 1 AATL","index":10,"n_rows":89,"n_cols":11,"rows_kept":89,"cut":false,"hidden":true,"merged":[]}
["CODIGO","NOMBRE","Característica 1","Característica 2","Característica 3","Característica 4","Unidad de facturación","GSE SA","Certicámara SA","Camerfirma","Olimpia IT"]
["AMSEDC-CD-01-1","Certificados de Firma Electrónica Acreditado","SEGMENTO 2","N/A","N/A","Todas las zonas","Plataforma mes",7649600,1420640,36062400,"N/A"]
["AMSEDC-CD-01-2","Certificados de Firma Electrónica Acreditado","SEGMENTO 2","N/A","N/A","Todas las zonas","Transacción",874.24,10490.88,3562.5279999999998,"N/A"]
["AMSEDC-CD-02-1-ESP 01","Certificados digitales de persona natural Acreditado-AATL","SEGMENTO 1 y 4","Token físico","1 año","Zona 1","Certificado",144905.28,273473.19999999995,172116,234077.76]
["AMSEDC-CD-02-2-ESP 01","Certificados digitales de persona natural Acreditado-AATL","SEGMENTO 1 y 4","Token físico","1 año","Zona 2","Certificado",159395.80799999999,273473.19999999995,183590.39999999999,234077.76]
["AMSEDC-CD-02-3-ESP 01","Certificados digitales de persona natural Acreditado-AATL","SEGMENTO 1 y 4","Token físico","1 año","Zona 3","Certificado",164969.08799999999,273473.19999999995,206539.2,234077.76]
["AMSEDC-CD-02-4-ESP 01","Certificados digitales de persona natural Acreditado-AATL","SEGMENTO 1 y 4","Token virtual","1 año","Todas las zonas","Certificado",133758.72,251595.34399999998,183590.39999999999,168313.05600000001]
["AMSEDC-CD-02-5-ESP 01","Certificados digitales de persona natural Acreditado-AATL","SEGMENTO 1 y 4","Token físico","2 años","Zona 1","Certificado",203982.04800000001,328167.83999999991,258174,345543.36]
["AMSEDC-CD-02-6-ESP 01","Certificados digitales de persona natural Acreditado-AATL","SEGMENTO 1 y 4","Token físico","2 años","Zona 2","Certificado",222931.20000000001,328167.83999999991,275385.59999999998,345543.36]
["AMSEDC-CD-02-7-ESP 01","Certificados digitales de persona natural Acreditado-AATL","SEGMENTO 1 y 4","Token físico","2 años","Zona 3","Certificado",229619.136,328167.83999999991,309808.8,345543.36]
["AMSEDC-CD-02-8-ESP 01","Certificados digitales de persona natural Acreditado-AATL","SEGMENTO 1 y 4","Token virtual","2 años","Todas las zonas","Certificado",160510.46400000001,328167.83999999991,275385.59999999998,278664]
["AMSEDC-CD-03-1-ESP 01","Certificados digitales de profesional titulado Acreditado-AATL","SEGMENTO 1 y 4","Token físico","1 año","Zona 1","Certificado",144905.28,273473.19999999995,172116,234077.76]
["AMSEDC-CD-03-2-ESP 01","Certificados digitales de profesional titulado Acreditado-AATL","SEGMENTO 1 y 4","Token físico","1 año","Zona 2","Certificado",159395.80799999999,273473.19999999995,183590.39999999999,234077.76]
["AMSEDC-CD-03-3-ESP 01","Certificados digitales de profesional titulado Acreditado-AATL","SEGMENTO 1 y 4","Token físico","1 año","Zona 3","Certificado",183918.24,273473.19999999995,206539.2,234077.76]
["AMSEDC-CD-03-4-ESP 01","Certificados digitales de profesional titulado Acreditado-AATL","SEGMENTO 1 y 4","Token virtual","1 año","Todas las zonas","Certificado",133758.72,251595.34399999998,183590.39999999999,168313.05600000001]
{"$rows_left_out":75}
{"sheet":"Lote 1 SIIF","index":11,"n_rows":95,"n_cols":11,"rows_kept":95,"cut":false,"hidden":true,"merged":[]}
["CODIGO","NOMBRE","Característica 1","Característica 2","Característica 3","Característica 4","Unidad de facturación","GSE SA","Certicámara SA","Camerfirma","Olimpia IT"]
["AMSEDC-CD-01-1","Certificados de Firma Electrónica Acreditado","SEGMENTO 2","N/A","N/A","Todas las zonas","Plataforma mes",7649600,1420640,36062400,"N/A"]
["AMSEDC-CD-01-2","Certificados de Firma Electrónica Acreditado","SEGMENTO 2","N/A","N/A","Todas las zonas","Transacción",874.24,10490.88,3562.5279999999998,"N/A"]
["AMSEDC-CD-02-1","Certificados digitales de persona natural Acreditado","SEGMENTO 1 y 4","Token físico","1 año","Zona 1","Certificado",142064,273200,163920,229488]
["AMSEDC-CD-02-2","Certificados digitales de persona natural Acreditado","SEGMENTO 1 y 4","Token físico","1 año","Zona 2","Certificado",156270.39999999999,273200,174848,229488]
["AMSEDC-CD-02-3","Certificados digitales de persona natural Acreditado","SEGMENTO 1 y 4","Token físico","1 año","Zona 3","Certificado",161734.39999999999,273200,196704,229488]
["AMSEDC-CD-02-4","Certificados digitales de persona natural Acreditado","SEGMENTO 1 y 4","Token virtual","1 año","Todas las zonas","Certificado",131136,251344,174848,165012.79999999999]
["AMSEDC-CD-02-5","Certificados digitales de persona natural Acreditado","SEGMENTO 1 y 4","Token físico","2 años","Zona 1","Certificado",199982.4,327840,245880,338768]
["AMSEDC-CD-02-6","Certificados digitales de persona natural Acreditado","SEGMENTO 1 y 4","Token físico","2 años","Zona 2","Certificado",218560,327840,262272,338768]
["AMSEDC-CD-02-7","Certificados digitales de persona natural Acreditado","SEGMENTO 1 y 4","Token físico","2 años","Zona 3","Certificado",225116.79999999999,327840,295056,338768]
["AMSEDC-CD-02-8","Certificados digitales de persona natural Acreditado","SEGMENTO 1 y 4","Token virtual","2 años","Todas las zonas","Certificado",157363.20000000001,327840,262272,273200]
["AMSEDC-CD-03-1","Certificados digitales de profesional titulado Acreditado","SEGMENTO 1 y 4","Token físico","1 año","Zona 1","Certificado",142064,273200,163920,229488]
["AMSEDC-CD-03-2","Certificados digitales de profesional titulado Acreditado","SEGMENTO 1 y 4","Token físico","1 año","Zona 2","Certificado",156270.39999999999,273200,174848,229488]
["AMSEDC-CD-03-3","Certificados digitales de profesional titulado Acreditado","SEGMENTO 1 y 4","Token físico","1 año","Zona 3","Certificado",180312,273200,196704,229488]
["AMSEDC-CD-03-4","Certificados digitales de profesional titulado Acreditado","SEGMENTO 1 y 4","Token virtual","1 año","Todas las zonas","Certificado",131136,251344,174848,165012.79999999999]
{"$rows_left_out":81}
{"sheet":"Lote 1 AATL + SIIF","index":12,"n_rows":95,"n_cols":11,"rows_kept":95,"cut":false,"hidden":true,"merged":[]}
["CODIGO","NOMBRE","Característica 1","Característica 2","Característica 3","Característica 4","Unidad de facturación","GSE SA","Certicámara SA","Camerfirma","Olimpia IT"]
["AMSEDC-CD-01-1","Certificados de Firma Electrónica Acreditado","SEGMENTO 2","N/A","N/A","Todas las zonas","Plataforma mes",7649600,1420640,36062400,"N/A"]
["AMSEDC-CD-01-2","Certificados de Firma Electrónica Acreditado","SEGMENTO 2","N/A","N/A","Todas las zonas","Transacción",874.24,10490.88,3562.5279999999998,"N/A"]
["AMSEDC-CD-02-1-ESP 01","Certificados digitales de persona natural Acreditado-AATL","SEGMENTO 1 y 4","Token físico","1 año","Zona 1","Certificado",144905.28,273473.19999999995,172116,234077.76]
["AMSEDC-CD-02-2-ESP 01","Certificados digitales de persona natural Acreditado-AATL","SEGMENTO 1 y 4","Token físico","1 año","Zona 2","Certificado",159395.80799999999,273473.19999999995,183590.39999999999,234077.76]
["AMSEDC-CD-02-3-ESP 01","Certificados digitales de persona natural Acreditado-AATL","SEGMENTO 1 y 4","Token físico","1 año","Zona 3","Certificado",164969.08799999999,273473.19999999995,206539.2,234077.76]
["AMSEDC-CD-02-4-ESP 01","Certificados digitales de persona natural Acreditado-AATL","SEGMENTO 1 y 4","Token virtual","1 año","Todas las zonas","Certificado",133758.72,251595.34399999998,183590.39999999999,168313.05600000001]
["AMSEDC-CD-02-5-ESP 01","Certificados digitales de persona natural Acreditado-AATL","SEGMENTO 1 y 4","Token físico","2 años","Zona 1","Certificado",203982.04800000001,328167.83999999991,258174,345543.36]
["AMSEDC-CD-02-6-ESP 01","Certificados digitales de persona natural Acreditado-AATL","SEGMENTO 1 y 4","Token físico","2 años","Zona 2","Certificado",222931.20000000001,328167.83999999991,275385.59999999998,345543.36]
["AMSEDC-CD-02-7-ESP 01","Certificados digitales de persona natural Acreditado-AATL","SEGMENTO 1 y 4","Token físico","2 años","Zona 3","Certificado",229619.136,328167.83999999991,309808.8,345543.36]
["AMSEDC-CD-02-8-ESP 01","Certificados digitales de persona natural Acreditado-AATL","SEGMENTO 1 y 4","Token virtual","2 años","Todas las zonas","Certificado",160510.46400000001,328167.83999999991,275385.59999999998,278664]
["AMSEDC-CD-03-1-ESP 01","Certificados digitales de profesional titulado Acreditado-AATL","SEGMENTO 1 y 4","Token físico","1 año","Zona 1","Certificado",144905.28,273473.19999999995,172116,234077.76]
["AMSEDC-CD-03-2-ESP 01","Certificados digitales de profesional titulado Acreditado-AATL","SEGMENTO 1 y 4","Token físico","1 año","Zona 2","Certificado",159395.80799999999,273473.19999999995,183590.39999999999,234077.76]
["AMSEDC-CD-03-3-ESP 01","Certificados digitales de profesional titulado Acreditado-AATL","SEGMENTO 1 y 4","Token físico","1 año","Zona 3","Certificado",183918.24,273473.19999999995,206539.2,234077.76]
["AMSEDC-CD-03-4-ESP 01","Certificados digitales de profesional titulado Acreditado-AATL","SEGMENTO 1 y 4","Token virtual","1 año","Todas las zonas","Certificado",133758.72,251595.34399999998,183590.39999999999,168313.05600000001]
{"$rows_left_out":81}
{"sheet":"Lote 2","index":13,"n_rows":47,"n_cols":9,"rows_kept":47,"cut":false,"hidden":true,"merged":[]}
["CODIGO","NOMBRE","Característica 1","Característica 2","Característica 3","Unidad de facturación","GSE SA","Certicámara SA","Camerfirma"]
["AMSEDC-SSL-01-1","Certificado digital de sitio web SSL DV Validación Dominio ","Virtual","1 año","Todas las Zonas","Certificado",163920,103816,109280]
["AMSEDC-SSL-01-2","Certificado digital de sitio web SSL DV Validación Dominio ","Virtual","2 años","Todas las Zonas","Certificado",327840,207632,218560]
["AMSEDC-SSL-02 -1","Certificado digital de sitio web SSL OV Validación Organización","Certificado SSL OV","1 año","Todas las Zonas","Certificado",1311360,1523729.2879999999,273200]
["AMSEDC-SSL-02 -2","Certificado digital de sitio web SSL OV Validación Organización","Certificado SSL - OV - Subdominio SAN","1 año","Todas las Zonas","Certificado",983520,1688376,273200]
["AMSEDC-SSL-02 -3","Certificado digital de sitio web SSL OV Validación Organización","Certificado SSL - OV - Wilcard","1 año","Todas las Zonas","Certificado",1857760,7448777.2368000001,1529920]
["AMSEDC-SSL-02 -4","Certificado digital de sitio web SSL OV Validación Organización","Certificado SSL OV","2 años","Todas las Zonas","Certificado",2622720,3047458.5759999999,546400]
["AMSEDC-SSL-02 -5","Certificado digital de sitio web SSL OV Validación Organización","Certificado SSL - OV - Subdominio SAN","2 años","Todas las Zonas","Certificado",1967040,3376752,546400]
["AMSEDC-SSL-02 -6","Certificado digital de sitio web SSL OV Validación Organización","Certificado SSL - OV - Wilcard","2 años","Todas las Zonas","Certificado",3715520,14897554.4736,3059840]
["AMSEDC-SSL-02 -7","Certificado digital de sitio web SSL OV Validación Organización","Funcionalidad escaneo diario de malware","1 año","Todas las Zonas","Certificado",3278400,2185600,601040]
["AMSEDC-SSL-02 -8","Certificado digital de sitio web SSL OV Validación Organización","Funcionalidad escaneo diario de malware","2 años","Todas las Zonas","Certificado",6556800,4371200,1202080]
["AMSEDC-SSL-03-1","Certificado digital de sitio web SSL EV Validación Extendida","Certificado SSL EV","1 año","Todas las Zonas","Certificado",2185600,5350159.7456,764960]
["AMSEDC-SSL-03-2","Certificado digital de sitio web SSL EV Validación Extendida","Certificado SSL EV - Subdominio SAN","1 año","Todas las Zonas","Certificado",1311360,3567992,764960]
["AMSEDC-SSL-03-3","Certificado digital de sitio web SSL EV Validación Extendida","Certificado SSL EV","2 años","Todas las Zonas","Certificado",4371200,10700319.4912,1529920]
["AMSEDC-SSL-03-4","Certificado digital de sitio web SSL EV Validación Extendida","Certificado SSL EV - Subdominio SAN","2 años","Todas las Zonas","Certificado",2622720,7135984,1529920]
{"$rows_left_out":33}
{"sheet":"CSV","index":14,"n_rows":3,"n_cols":7,"rows_kept":3,"cut":false,"hidden":true,"merged":[]}
["Tipo","Cantidad","Código de unidad de medida","Precio base","Divisa","Descripción","Mercancía"]
["item",1,"Und","207632","COP","idg01--AMSEDC-SSL-01-2-Certificado digital de sitio web SSL DV Validación Dominio "]
["item",1,"Und","39450,08","COP","idg01--IVA"]

{"sheet":"formatoCeldas","index":15,"n_rows":18,"n_cols":21,"rows_kept":18,"cut":false,"hidden":true,"merged":[[9,1,9,2],[8,1,8,2],[8,3,8,7],[9,3,9,7],[12,1,12,2],[12,3,12,7],[17,1,17,2],[13,1,13,2],[16,1,16,2],[16,3,16,7],[13,3,13,7],[17,3,17,7]]}
[]
["Campo de usuario"]
[]
["Campo de usuario resaltado"]
[]
["Campo de usuario bloqueado"]
[]
[]
["Item","Código",null,"Nombre",null,null,null,null,"Caracteristica 1","Característica 2","Característica 3","Característica 4","Unidad de Facturación","Cantidad"]
[]
[]
[]
["Item","Código",null,"Nombre",null,null,null,null,"Caracteristica 1","Característica 2","Característica 3","Característica 4","Unidad de Facturación","Cantidad","Precio Catálogo","Precio + Gravamen ","Precio x Cantidad","IVA","Subtotal"]
[null,null,null,null,null,null,null,null,null,null,null,null,null,null,null,{"$f":"ROUND(IFERROR((O14)/(1-TotalGravamen),\"\"),2)","v":0},{"$f":"ROUND(IFERROR(N14*P14,\"\"),2)","v":0},{"$f":"ROUND(IFERROR(Q14*0.19,\"\"),2)","v":0},{"$f":"IFERROR(Q14+R14,\"\")","v":0}]
[]
{"$rows_left_out":3}